BDBM50063276 CHEMBL164604::{4-[2-(4-Phenyl-3,6-dihydro-2H-pyridin-1-yl)-ethyl]-cyclohexyl}-pyrimidin-2-yl-amine
SMILES C(CN1CCC(=CC1)c1ccccc1)[C@H]1CC[C@@H](CC1)Nc1ncccn1
InChI Key InChIKey=BDHDIEVXYUODTG-XYWHTSSQSA-N
Data  3 KI
  Tab Delimited (TSV)   2D SDfile   Computed 3D by Vconf -m prep SDfile
Find this compound or compounds like it in BindingDB:
Activity Spreadsheet -- Enzyme Inhibition Constant Data from BindingDB
Found 3 hits for monomerid = 50063276
TargetD(3) dopamine receptor(Homo sapiens (Human))
Warner-Lambert
Curated by ChEMBL
LigandPNGBDBM50063276(CHEMBL164604 | {4-[2-(4-Phenyl-3,6-dihydro-2H-pyri...)
Affinity DataKi:  3.70nM. Assay description: Binding affinity determined by measuring displacement of [3H]-spiperone from cloned Human Dopamine receptor D3 in CHO-K1 cells
In DepthDetails ArticlePubMed
Target5-hydroxytryptamine receptor 1A(Rattus norvegicus (rat))
Warner-Lambert
Curated by ChEMBL
LigandPNGBDBM50063276(CHEMBL164604 | {4-[2-(4-Phenyl-3,6-dihydro-2H-pyri...)
Affinity DataKi:  3.90nM. Assay description: The binding affinity of the compound was determined by measuring its ability to displace [3H]-8-OH-DPAT radioligand in 5-hydroxytryptamine 1A recepto...
In DepthDetails ArticlePubMed
TargetD(2) dopamine receptor(Homo sapiens (Human))
Warner-Lambert
Curated by ChEMBL
LigandPNGBDBM50063276(CHEMBL164604 | {4-[2-(4-Phenyl-3,6-dihydro-2H-pyri...)
Affinity DataKi:  4.70nM. Assay description: Binding affinity determined by measuring its ability to displace [3H]-N-0437 radioligand in CHO-K1 cells on Cloned Human Dopamine receptor D2
In DepthDetails ArticlePubMed