BDBM50064673 1-Methyl-phenoxathiine; compound with 3-methyl-phenoxathiine::CHEMBL68404
SMILES Cc1cccc2Oc3ccccc3Sc12
InChI Key InChIKey=UGFMYKUFBSSFKP-UHFFFAOYSA-N
Data  1 IC50
  Tab Delimited (TSV)   2D SDfile   Computed 3D by Vconf -m prep SDfile
Find this compound or compounds like it in BindingDB:
Activity Spreadsheet -- Enzyme Inhibition Constant Data from BindingDB
Found 1 hit for monomerid = 50064673
TargetAmine oxidase [flavin-containing] A(Rattus norvegicus (rat))
The Wellcome Research Laboratories
Curated by ChEMBL
LigandPNGBDBM50064673(1-Methyl-phenoxathiine; compound with 3-methyl-phe...)
Affinity DataIC50:  610nM. Assay description: The inhibitory concentration against Monoamine oxidase A
In DepthDetails ArticlePubMed