BDBM50064882 4-[(S)-(R)-3-[3,4-Dihydroxy-5-(1-hydroxy-ethyl)-tetrahydro-furan-2-yloxy]-2-(2-tetradecyl-hexadecanoylamino)-propionylamino]-4-methylcarbamoyl-butyrate(S)-1-formyl-4-guanidino-butyl-ammonium;::CHEMBL305648
SMILES CCCCCCCCCCCCCCC(CCCCCCCCCCCCCC)C(=O)N[C@H](COC1OC(C(C)O)C(O)C1O)C(=O)NC(CCC([O-])=O)C(=O)NC
InChI Key InChIKey=WKTMUEATCAIVGL-RZTGEYPLSA-M
Data  1 IC50
  Tab Delimited (TSV)   2D SDfile   Computed 3D by Vconf -m prep SDfile
Find this compound or compounds like it in BindingDB:
Activity Spreadsheet -- Enzyme Inhibition Constant Data from BindingDB
Found 1 hit for monomerid = 50064882
TargetE-selectin(Homo sapiens (Human))
Kanebo
Curated by ChEMBL
LigandPNGBDBM50064882(4-[(S)-(R)-3-[3,4-Dihydroxy-5-(1-hydroxy-ethyl)-te...)
Affinity DataIC50:  4.30E+3nM. Assay description: In vitro inhibitory activity against Selectin E-sialyl Lewis X (sLex) binding
In DepthDetails ArticlePubMed