BDBM50065357 (S)-2-Amino-5-m-tolylsulfanyl-pentanoic acid::CHEMBL90963
SMILES Cc1cccc(SCCC[C@H](N)C(O)=O)c1
InChI Key InChIKey=IGLUMGLMRMKLJE-NSHDSACASA-N
Data  2 IC50
  Tab Delimited (TSV)   2D SDfile   Computed 3D by Vconf -m prep SDfile
Find this compound or compounds like it in BindingDB:
Activity Spreadsheet -- Enzyme Inhibition Constant Data from BindingDB
Found 2 hits for monomerid = 50065357
TargetNitric oxide synthase, brain(Rattus norvegicus (rat))
Abbott Laboratories
Curated by ChEMBL
LigandPNGBDBM50065357((S)-2-Amino-5-m-tolylsulfanyl-pentanoic acid | CHE...)
Affinity DataIC50: >1.00E+5nM. Assay description: Inhibition of arginine to citrulline conversion by Neuronal nitric oxide synthase from rat brain
In DepthDetails ArticlePubMed
TargetNitric oxide synthase, inducible(Mus musculus (mouse))
Abbott Laboratories
Curated by ChEMBL
LigandPNGBDBM50065357((S)-2-Amino-5-m-tolylsulfanyl-pentanoic acid | CHE...)
Affinity DataIC50: >1.00E+5nM. Assay description: Inhibition of radiolabeled arginine conversion to citrulline by isomeric form of Inducible nitric oxide synthase from mouse RAW 264.7 cells
In DepthDetails ArticlePubMed