BDBM50065932 CHEMBL99050::ethyl (ethoxycarbonyl)oxy(methylsulfonyl)carbamate
SMILES CCOC(=O)ON(C(=O)OCC)S(C)(=O)=O
InChI Key InChIKey=MOWYJRBIQFEGEZ-UHFFFAOYSA-N
Data  1 IC50
  Tab Delimited (TSV)   2D SDfile   Computed 3D by Vconf -m prep SDfile
Find this compound or compounds like it in BindingDB:
Activity Spreadsheet -- Enzyme Inhibition Constant Data from BindingDB
Found 1 hit for monomerid = 50065932
TargetAldehyde dehydrogenase 1A1(Rattus norvegicus)
St. Cloud State University
Curated by ChEMBL
LigandPNGBDBM50065932(CHEMBL99050 | ethyl (ethoxycarbonyl)oxy(methylsulf...)
Affinity DataIC50:  3.56E+4nM. Assay description: Inhibitory activity of the compound against yeast aldehyde dehydrogenase(AIDH)
In DepthDetails ArticlePubMed