BDBM50066302 3,4-Dichloro-benzoic acid N'-(3,4-dichloro-benzoyl)-hydrazide::CHEMBL421416
SMILES Clc1ccc(cc1Cl)C(=O)NNC(=O)c1ccc(Cl)c(Cl)c1
InChI Key InChIKey=FMTOEJTZGHGOKG-UHFFFAOYSA-N
Data  2 IC50
  Tab Delimited (TSV)   2D SDfile   Computed 3D by Vconf -m prep SDfile
Find this compound or compounds like it in BindingDB:
Activity Spreadsheet -- Enzyme Inhibition Constant Data from BindingDB
Found 2 hits for monomerid = 50066302
TargetIntegrase(Human immunodeficiency virus 1)
National Cancer Institute-Bethesda
Curated by ChEMBL
LigandPNGBDBM50066302(3,4-Dichloro-benzoic acid N'-(3,4-dichloro-benzoyl...)
Affinity DataIC50: >1.00E+5nM. Assay description: Inhibitory concentration as 50% inhibition of HIV-1 integrase enzyme at strand transfer stage of DNA integration.
In DepthDetails ArticlePubMed
TargetIntegrase(Human immunodeficiency virus 1)
National Cancer Institute-Bethesda
Curated by ChEMBL
LigandPNGBDBM50066302(3,4-Dichloro-benzoic acid N'-(3,4-dichloro-benzoyl...)
Affinity DataIC50: >1.00E+5nM. Assay description: Inhibition of HIV-1 integrase enzyme at 3`- processing stage of DNA integration
In DepthDetails ArticlePubMed