BDBM50066330 CHEMBL108500::Naphthalene-1-carboxylic acid N'-(2-fluoro-benzoyl)-hydrazide
SMILES Fc1ccccc1C(=O)NNC(=O)c1cccc2ccccc12
InChI Key InChIKey=VDSKEBOQJYLNDT-UHFFFAOYSA-N
Data  2 IC50
  Tab Delimited (TSV)   2D SDfile   Computed 3D by Vconf -m prep SDfile
Find this compound or compounds like it in BindingDB:
Activity Spreadsheet -- Enzyme Inhibition Constant Data from BindingDB
Found 2 hits for monomerid = 50066330
TargetIntegrase(Human immunodeficiency virus 1)
National Cancer Institute-Bethesda
Curated by ChEMBL
LigandPNGBDBM50066330(CHEMBL108500 | Naphthalene-1-carboxylic acid N'-(2...)
Affinity DataIC50: >1.00E+5nM. Assay description: Inhibitory concentration as 50% inhibition of HIV-1 integrase enzyme at strand transfer stage of DNA integration.
In DepthDetails ArticlePubMed
TargetIntegrase(Human immunodeficiency virus 1)
National Cancer Institute-Bethesda
Curated by ChEMBL
LigandPNGBDBM50066330(CHEMBL108500 | Naphthalene-1-carboxylic acid N'-(2...)
Affinity DataIC50: >1.00E+5nM. Assay description: Inhibition of HIV-1 integrase enzyme at 3`- processing stage of DNA integration
In DepthDetails ArticlePubMed