BDBM50066987 CHEMBL127408::[(R)-2-(2-Benzyloxycarbonylamino-4-methyl-pentanoylamino)-4-methyl-pentanoyl]-phosphonic acid monomethyl ester
SMILES COP(O)(=O)C(=O)[C@@H](CC(C)C)NC(=O)C(CC(C)C)NC(=O)OCc1ccccc1
InChI Key InChIKey=BPWLEQRWVUCPRO-QRWMCTBCSA-N
Data  1 IC50
  Tab Delimited (TSV)   2D SDfile   Computed 3D by Vconf -m prep SDfile
Find this compound or compounds like it in BindingDB:
Activity Spreadsheet -- Enzyme Inhibition Constant Data from BindingDB
Found 1 hit for monomerid = 50066987
TargetCalpain-1 catalytic subunit(Homo sapiens (Human))
Cephalon
Curated by ChEMBL
LigandPNGBDBM50066987(CHEMBL127408 | [(R)-2-(2-Benzyloxycarbonylamino-4-...)
Affinity DataIC50:  5.20E+3nM. Assay description: inhibitory activity measured against recombinant human Calpain-I receptor
In DepthDetails ArticlePubMed