BDBM50067032 (E)-3-(4-Hydroxy-phenyl)-1-{3-[(E)-3-(4-hydroxy-phenyl)-acryloyl]-phenyl}-propenone::3-(4-Hydroxy-phenyl)-1-{3-[3-(4-hydroxy-phenyl)-acryloyl]-phenyl}-propenone::CHEMBL340202
SMILES Oc1ccc(\C=C\C(=O)c2cccc(c2)C(=O)\C=C\c2ccc(O)cc2)cc1
InChI Key InChIKey=OETARLPOXIOAFP-VOMDNODZSA-N
Data  2 IC50
  Tab Delimited (TSV)   2D SDfile   Computed 3D by Vconf -m prep SDfile
Find this compound or compounds like it in BindingDB:
Activity Spreadsheet -- Enzyme Inhibition Constant Data from BindingDB
Found 2 hits for monomerid = 50067032
TargetIntegrase(Human immunodeficiency virus 1)
University Of Tennessee Health Science Center
Curated by ChEMBL
LigandPNGBDBM50067032((E)-3-(4-Hydroxy-phenyl)-1-{3-[(E)-3-(4-hydroxy-ph...)
Affinity DataIC50:  3.02E+4nM. Assay description: Inhibitory activity against HIV-1 Integrase (HIV-1-IN)
In DepthDetails ArticlePubMed
TargetIntegrase(Human immunodeficiency virus 1)
University Of Tennessee Health Science Center
Curated by ChEMBL
LigandPNGBDBM50067032((E)-3-(4-Hydroxy-phenyl)-1-{3-[(E)-3-(4-hydroxy-ph...)
Affinity DataIC50:  3.00E+4nM. Assay description: Compound concentration required to reduce HIV-1 Integrase 3'-processing activity by 50%
In DepthDetails ArticlePubMed