BDBM50067272 4-{(E)-2-[({[2,4-Dichloro-3-(3-methyl-isoquinolin-5-yloxymethyl)-phenyl]-methyl-carbamoyl}-methyl)-carbamoyl]-vinyl}-N-methyl-benzamide::CHEMBL336407
SMILES CNC(=O)c1ccc(\C=C\C(=O)NCC(=O)N(C)c2ccc(Cl)c(COc3cccc4cnc(C)cc34)c2Cl)cc1
InChI Key InChIKey=SWNLCVZTMQTWIU-NTEUORMPSA-N
Data  2 IC50
  Tab Delimited (TSV)   2D SDfile   Computed 3D by Vconf -m prep SDfile
Find this compound or compounds like it in BindingDB:
Activity Spreadsheet -- Enzyme Inhibition Constant Data from BindingDB
Found 2 hits for monomerid = 50067272
TargetB2 bradykinin receptor(Homo sapiens (Human))
Fujisawa Pharmaceutical
Curated by ChEMBL
LigandPNGBDBM50067272(4-{(E)-2-[({[2,4-Dichloro-3-(3-methyl-isoquinolin-...)
Affinity DataIC50: >1.00E+4nM. Assay description: Concentration required to inhibit specific binding of [3H]BK (1.2 nM) to A-431 cells (human epidermoidcarcinoma) which express Bradykinin receptor B2...
In DepthDetails ArticlePubMed
TargetB2 bradykinin receptor(Cavia porcellus)
Fujisawa Pharmaceutical
Curated by ChEMBL
LigandPNGBDBM50067272(4-{(E)-2-[({[2,4-Dichloro-3-(3-methyl-isoquinolin-...)
Affinity DataIC50: >1.00E+4nM. Assay description: Concentration required to inhibit specific binding of [ 3H]BK (0.06 nM) to Bradykinin receptor B2 in guinea pig ileum membrane preparations by 50%.
In DepthDetails ArticlePubMed