BDBM50067309 4-{(E)-2-[({[3-(2-Dimethylamino-1-methyl-1H-benzoimidazol-4-yloxymethyl)-2,4-dimethyl-phenyl]-methyl-carbamoyl}-methyl)-carbamoyl]-vinyl}-N-methyl-benzamide::CHEMBL240875
SMILES CNC(=O)c1ccc(\C=C\C(=O)NCC(=O)N(C)c2ccc(C)c(COc3cccc4n(C)c(nc34)N(C)C)c2C)cc1
InChI Key InChIKey=MKFKIDJMFXAQFH-NBVRZTHBSA-N
Data  4 IC50
  Tab Delimited (TSV)   2D SDfile   Computed 3D by Vconf -m prep SDfile
Find this compound or compounds like it in BindingDB:
Activity Spreadsheet -- Enzyme Inhibition Constant Data from BindingDB
Found 4 hits for monomerid = 50067309
TargetB2 bradykinin receptor(Cavia porcellus)
Fujisawa Pharmaceutical
Curated by ChEMBL
LigandPNGBDBM50067309(4-{(E)-2-[({[3-(2-Dimethylamino-1-methyl-1H-benzoi...)
Affinity DataIC50:  38nM. Assay description: Concentration required to inhibit specific binding of [ 3H]BK (0.06 nM) to Bradykinin receptor B2 in guinea pig ileum membrane preparations by 50%.
In DepthDetails ArticlePubMed
TargetB2 bradykinin receptor(Homo sapiens (Human))
Fujisawa Pharmaceutical
Curated by ChEMBL
LigandPNGBDBM50067309(4-{(E)-2-[({[3-(2-Dimethylamino-1-methyl-1H-benzoi...)
Affinity DataIC50:  160nM. Assay description: In vitro inhibitory activity towards human bradykinin receptor B2 expressed in CHO cells using [3H]BK (1.0 nM) as a radioligand
In DepthDetails ArticlePubMed
TargetB2 bradykinin receptor(Homo sapiens (Human))
Fujisawa Pharmaceutical
Curated by ChEMBL
LigandPNGBDBM50067309(4-{(E)-2-[({[3-(2-Dimethylamino-1-methyl-1H-benzoi...)
Affinity DataIC50:  38nM. Assay description: In vitro inhibitory activity towards bradykinin receptor B2 using [3H]BK (0.06 nM) as a radioligand in guinea pig ileum membrane preparation
In DepthDetails ArticlePubMed
TargetB2 bradykinin receptor(Homo sapiens (Human))
Fujisawa Pharmaceutical
Curated by ChEMBL
LigandPNGBDBM50067309(4-{(E)-2-[({[3-(2-Dimethylamino-1-methyl-1H-benzoi...)
Affinity DataIC50:  38nM. Assay description: Concentration required to inhibit specific binding of [ 3H]BK (0.06 nM) to Bradykinin receptor B2 in guinea pig ileum membrane preparations by 50%.
In DepthDetails ArticlePubMed