BDBM50067912 2-furan boronic acid::CHEMBL142083::furan 2-boronic acid
SMILES OB(O)c1ccco1
InChI Key InChIKey=PZJSZBJLOWMDRG-UHFFFAOYSA-N
Data  1 KI
  Tab Delimited (TSV)   2D SDfile   Computed 3D by Vconf -m prep SDfile
Find this compound or compounds like it in BindingDB:
Activity Spreadsheet -- Enzyme Inhibition Constant Data from BindingDB
Found 1 hit for monomerid = 50067912
TargetBeta-lactamase(Escherichia coli)
Northwestern University Medical School
Curated by ChEMBL
LigandPNGBDBM50067912(2-furan boronic acid | CHEMBL142083 | furan 2-boro...)
Affinity DataKi: >1.00E+5nM. Assay description: Inhibitory activity against E. coli AmpC beta-lactamase.
In DepthDetails ArticlePubMed