BDBM50068148 CHEMBL145415::N-[2-(6-Amino-purin-9-yl)-4-hydroxy-5-hydroxymethyl-tetrahydro-furan-3-yl]-2-hydroxy-3-methoxy-benzamide
SMILES COc1cccc(C(=O)NC2C(O)C(CO)OC2n2cnc3c(N)ncnc23)c1O
InChI Key InChIKey=CRJMVWPSFHUFMD-UHFFFAOYSA-N
Data  1 IC50
  Tab Delimited (TSV)   2D SDfile   Computed 3D by Vconf -m prep SDfile
Find this compound or compounds like it in BindingDB:
Activity Spreadsheet -- Enzyme Inhibition Constant Data from BindingDB
Found 1 hit for monomerid = 50068148
TargetGlyceraldehyde-3-phosphate dehydrogenase(Homo sapiens (Human))
University Of Washington
Curated by ChEMBL
LigandPNGBDBM50068148(CHEMBL145415 | N-[2-(6-Amino-purin-9-yl)-4-hydroxy...)
Affinity DataIC50:  6.00E+5nM. Assay description: Inhibitory activity measured for Glyceraldehyde-3-phosphate dehydrogenase (GAPDH) in Leishmania. mexicana
In DepthDetails ArticlePubMed