BDBM50068164 Acetic acid 2-(3-phenyl-propylsulfanyl)-phenyl ester::CHEMBL145354
SMILES CC(=O)Oc1ccccc1SCCCc1ccccc1
InChI Key InChIKey=AEONPOKEIUZARX-UHFFFAOYSA-N
Data  2 IC50
  Tab Delimited (TSV)   2D SDfile   Computed 3D by Vconf -m prep SDfile
Find this compound or compounds like it in BindingDB:
Activity Spreadsheet -- Enzyme Inhibition Constant Data from BindingDB
Found 2 hits for monomerid = 50068164
TargetProstaglandin G/H synthase 1(Ovis aries (Sheep))
Center In Molecular Toxicology And The Vanderbilt Cancer Center
Curated by ChEMBL
LigandPNGBDBM50068164(Acetic acid 2-(3-phenyl-propylsulfanyl)-phenyl est...)
Affinity DataIC50: >1.00E+6nM. Assay description: Inhibitory concentration in DMSO with purified ovine Prostaglandin G/H synthase 1 (COX-1).
In DepthDetails ArticlePubMed
TargetProstaglandin G/H synthase 2(Homo sapiens (Human))
Center In Molecular Toxicology And The Vanderbilt Cancer Center
Curated by ChEMBL
LigandPNGBDBM50068164(Acetic acid 2-(3-phenyl-propylsulfanyl)-phenyl est...)
Affinity DataIC50: >1.00E+6nM. Assay description: Inhibitory concentration in DMSO with purified human Prostaglandin G/H synthase 2 (COX-2)
In DepthDetails ArticlePubMed