BDBM50070863 (2S,3S,4R,5R)-5-(6-Benzylamino-purin-9-yl)-3,4-dihydroxy-tetrahydro-furan-2-carboxylic acid methylamide::CHEMBL49843
SMILES CNC(=O)[C@H]1O[C@H]([C@H](O)[C@@H]1O)n1cnc2c(NCc3ccccc3)ncnc12
InChI Key InChIKey=XZQKRHODUKHITR-MOROJQBDSA-N
Data  8 KI
  Tab Delimited (TSV)   2D SDfile   Computed 3D by Vconf -m prep SDfile
Find this compound or compounds like it in BindingDB:
Activity Spreadsheet -- Enzyme Inhibition Constant Data from BindingDB
Found 8 hits for monomerid = 50070863
TargetAdenosine receptor A3(Rattus norvegicus)
National Institute Of Diabetes
Curated by ChEMBL
LigandPNGBDBM50070863((2S,3S,4R,5R)-5-(6-Benzylamino-purin-9-yl)-3,4-dih...)
Affinity DataKi:  16nM. Assay description: Binding affinity for recombinant rat A3-adenosine receptor by the displacement of specific [125I]APNEA or [125I]-N6-(4-amino-3-iodobenzyl)-adenosine-...
In DepthDetails ArticlePubMed
TargetAdenosine receptor A3(Rattus norvegicus)
National Institute Of Diabetes
Curated by ChEMBL
LigandPNGBDBM50070863((2S,3S,4R,5R)-5-(6-Benzylamino-purin-9-yl)-3,4-dih...)
Affinity DataKi:  16nM. Assay description: Binding affinity determined by displacement of specific binding of [125I]N-(4-amino-3-iodophenethyl)-adenosine in membranes of CHO cells stably trans...
In DepthDetails ArticlePubMed
TargetAdenosine receptor A3(Homo sapiens (Human))
Novo Nordisk
Curated by ChEMBL
LigandPNGBDBM50070863((2S,3S,4R,5R)-5-(6-Benzylamino-purin-9-yl)-3,4-dih...)
Affinity DataKi:  41nM. Assay description: Binding affinity for adenosine A3 receptor as inhibition of [125I]-AB-MECA binding to human receptor expressed in HEK 293 cells
In DepthDetails ArticlePubMed
TargetAdenosine receptor A2a(Rattus norvegicus (rat))
National Institute Of Diabetes
Curated by ChEMBL
LigandPNGBDBM50070863((2S,3S,4R,5R)-5-(6-Benzylamino-purin-9-yl)-3,4-dih...)
Affinity DataKi:  597nM. Assay description: Binding affinity to adenosine A2A receptor in rat striatal membranes by measuring displacement of specific [3H]-CGS- 21680 as radioligand
In DepthDetails ArticlePubMed
TargetAdenosine receptor A1(Rattus norvegicus (rat))
National Institute Of Diabetes
Curated by ChEMBL
LigandPNGBDBM50070863((2S,3S,4R,5R)-5-(6-Benzylamino-purin-9-yl)-3,4-dih...)
Affinity DataKi:  898nM. Assay description: Binding affinity to adenosine A1 receptor in rat brain membranes by measuring displacement of specific [3H]PIA as radioligand.
In DepthDetails ArticlePubMed
TargetAdenosine receptor A1(Rattus norvegicus (rat))
National Institute Of Diabetes
Curated by ChEMBL
LigandPNGBDBM50070863((2S,3S,4R,5R)-5-(6-Benzylamino-purin-9-yl)-3,4-dih...)
Affinity DataKi:  898nM. Assay description: Binding affinity for A1-adenosine receptor by the displacement of specific [3H]-PIA binding in rat brain was determined
In DepthDetails ArticlePubMed
TargetAdenosine receptor A2a(Rattus norvegicus (rat))
National Institute Of Diabetes
Curated by ChEMBL
LigandPNGBDBM50070863((2S,3S,4R,5R)-5-(6-Benzylamino-purin-9-yl)-3,4-dih...)
Affinity DataKi:  2.10E+3nM. Assay description: Binding affinity for adenosine A2a receptor as inhibition of 3[H]-CGS 21680 binding in rat striatum
In DepthDetails ArticlePubMed
TargetAdenosine receptor A1(Rattus norvegicus (rat))
National Institute Of Diabetes
Curated by ChEMBL
LigandPNGBDBM50070863((2S,3S,4R,5R)-5-(6-Benzylamino-purin-9-yl)-3,4-dih...)
Affinity DataKi:  2.40E+3nM. Assay description: Binding affinity for adenosine A1 receptor as inhibition of 3[H]-R-PIA binding in rat brain
In DepthDetails ArticlePubMed