BDBM50072907 CHEMBL3410080
SMILES O=C(NC1CC1)c1ccc(cc1)-c1cnc2c(NCC3CCOCC3)cc(NC3CCCCC3)nn12
InChI Key InChIKey=ZOSFYOBMRYUXAN-UHFFFAOYSA-N
Data  2 IC50
PDB links: 1 PDB ID matches this monomer.
  Tab Delimited (TSV)   2D SDfile   Computed 3D by Vconf -m prep SDfile
Find this compound or compounds like it in BindingDB:
Activity Spreadsheet -- Enzyme Inhibition Constant Data from BindingDB
Found 2 hits for monomerid = 50072907
TargetDual specificity protein kinase TTK(Homo sapiens (Human))
Shionogi Pharmaceutical Research Center
Curated by ChEMBL
LigandPNGBDBM50072907(CHEMBL3410080)
Affinity DataIC50:  5.60nM. Assay description: Inhibition of FLAG-tagged Mps1 autophosphorylation in human RERF-LC-AI cells expressing Tet-suppressible promotor after 3 hrs by immunoblotting
TargetDual specificity protein kinase TTK(Homo sapiens (Human))
Shionogi Pharmaceutical Research Center
Curated by ChEMBL
LigandPNGBDBM50072907(CHEMBL3410080)
Affinity DataIC50:  6.60nM. Assay description: Inhibition of Mps1 (unknown origin)-mediated p38 MAPK phosphorylation after 90 mins by DELFIA assay