BDBM50073212 (S)-2-[(Formyl-hydroxy-amino)-methyl]-4-methyl-pentanoic acid methyl ester::CHEMBL119569
SMILES COC(=O)[C@@H](CC(C)C)CN(O)C=O
InChI Key InChIKey=XDMGHAHHZVJBBJ-QMMMGPOBSA-N
Data  1 KI
  Tab Delimited (TSV)   2D SDfile   Computed 3D by Vconf -m prep SDfile
Find this compound or compounds like it in BindingDB:
Activity Spreadsheet -- Enzyme Inhibition Constant Data from BindingDB
Found 1 hit for monomerid = 50073212
TargetThermolysin(Bacillus thermoproteolyticus)
Pohang University Of Science And Technology
Curated by ChEMBL
LigandPNGBDBM50073212((S)-2-[(Formyl-hydroxy-amino)-methyl]-4-methyl-pen...)
Affinity DataKi:  2.25E+4nM. Assay description: Inhibitory activity against thermolysin
In DepthDetails ArticlePubMed