BDBM50073852 CHEMBL32172::Sulfamic acid 4-{(Z)-1-[4-(2-dimethylamino-ethoxy)-phenyl]-2-phenyl-but-1-enyl}-phenyl ester
SMILES CC\C(=C(/c1ccc(OCCN(C)C)cc1)c1ccc(OS(N)(=O)=O)cc1)c1ccccc1
InChI Key InChIKey=NSDNSKZEYQJJAH-QPLCGJKRSA-N
Data  2 KI
  Tab Delimited (TSV)   2D SDfile   Computed 3D by Vconf -m prep SDfile
Find this compound or compounds like it in BindingDB:
Activity Spreadsheet -- Enzyme Inhibition Constant Data from BindingDB
Found 2 hits for monomerid = 50073852
TargetSteryl-sulfatase(Homo sapiens (Human))
Indian Institute Of Technology (Bhu)
Curated by ChEMBL
LigandPNGBDBM50073852(CHEMBL32172 | Sulfamic acid 4-{(Z)-1-[4-(2-dimethy...)
Affinity DataKi: >5.00E+5nM. Assay description: Inhibition of sulfatase (unknown origin)
In DepthDetails ArticlePubMed
TargetSteryl-sulfatase(Rattus norvegicus)
Duquesne University
Curated by ChEMBL
LigandPNGBDBM50073852(CHEMBL32172 | Sulfamic acid 4-{(Z)-1-[4-(2-dimethy...)
Affinity DataKi: >5.00E+5nM. Assay description: In vitro binding affinity against estrone sulfatase in rat liver microsomes
In DepthDetails ArticlePubMed