BDBM50074789 3-Amino-2-phenyl-quinoline-4-carboxylic acid ((R)-1-phenyl-propyl)-amide::CHEMBL10224
SMILES CC[C@@H](NC(=O)c1c(N)c(nc2ccccc12)-c1ccccc1)c1ccccc1
InChI Key InChIKey=WHYVQTNGHLVEHF-HXUWFJFHSA-N
Data  4 KI
  Tab Delimited (TSV)   2D SDfile   Computed 3D by Vconf -m prep SDfile
Find this compound or compounds like it in BindingDB:
Activity Spreadsheet -- Enzyme Inhibition Constant Data from BindingDB
Found 4 hits for monomerid = 50074789
TargetNeuromedin-K receptor(Homo sapiens (Human))
Smithkline Beecham
Curated by ChEMBL
LigandPNGBDBM50074789(3-Amino-2-phenyl-quinoline-4-carboxylic acid ((R)-...)
Affinity DataKi:  1.20nM. Assay description: Binding affinity towards cloned human Tachykinin receptor 3 (hNK-3) expressed in CHO cells using [125I][MePhe7]-NKB
In DepthDetails ArticlePubMed
TargetNeuromedin-K receptor(Homo sapiens (Human))
Smithkline Beecham
Curated by ChEMBL
LigandPNGBDBM50074789(3-Amino-2-phenyl-quinoline-4-carboxylic acid ((R)-...)
Affinity DataKi:  2nM. Assay description: Displacement of [125I]-MePhe7-NKB from human NK3 receptor expressed in CHO cells after 90 mins by gamma counting
In DepthDetails ArticlePubMed
TargetSubstance-K receptor(Homo sapiens (Human))
Smithkline Beecham
Curated by ChEMBL
LigandPNGBDBM50074789(3-Amino-2-phenyl-quinoline-4-carboxylic acid ((R)-...)
Affinity DataKi:  111nM. Assay description: Binding affinity towards cloned human Tachykinin receptor 2 (hNK-2) expressed in CHO cells using [125I][MePhe7]-NKB
In DepthDetails ArticlePubMed
TargetSubstance-P receptor(Homo sapiens (Human))
Smithkline Beecham
Curated by ChEMBL
LigandPNGBDBM50074789(3-Amino-2-phenyl-quinoline-4-carboxylic acid ((R)-...)
Affinity DataKi: >1.00E+5nM. Assay description: Binding affinity towards cloned human Tachykinin receptor 1 (hNK-1) expressed in CHO cells using [125I][MePhe7]-NKB
In DepthDetails ArticlePubMed