BDBM50074821 2-Phenyl-quinoline-4-carboxylic acid (1-phenyl-octyl)-amide::CHEMBL10333
SMILES CCCCCCCC(NC(=O)c1cc(nc2ccccc12)-c1ccccc1)c1ccccc1
InChI Key InChIKey=UFOLZNRDMNZNNA-UHFFFAOYSA-N
Data  3 KI
  Tab Delimited (TSV)   2D SDfile   Computed 3D by Vconf -m prep SDfile
Find this compound or compounds like it in BindingDB:
Activity Spreadsheet -- Enzyme Inhibition Constant Data from BindingDB
Found 3 hits for monomerid = 50074821
TargetNeuromedin-K receptor(Homo sapiens (Human))
Smithkline Beecham
Curated by ChEMBL
LigandPNGBDBM50074821(2-Phenyl-quinoline-4-carboxylic acid (1-phenyl-oct...)
Affinity DataKi:  4.87E+3nM. Assay description: Binding affinity towards cloned human Tachykinin receptor 3 (hNK-3) expressed in CHO cells using [125I][MePhe7]-NKB
In DepthDetails ArticlePubMed
TargetNeuromedin-K receptor(Homo sapiens (Human))
Smithkline Beecham
Curated by ChEMBL
LigandPNGBDBM50074821(2-Phenyl-quinoline-4-carboxylic acid (1-phenyl-oct...)
Affinity DataKi:  5.01E+3nM. Assay description: Displacement of [125I]-MePhe7-NKB from human NK3 receptor expressed in CHO cells after 90 mins by gamma counting
In DepthDetails ArticlePubMed
TargetNeuromedin-K receptor(Homo sapiens (Human))
Smithkline Beecham
Curated by ChEMBL
LigandPNGBDBM50074821(2-Phenyl-quinoline-4-carboxylic acid (1-phenyl-oct...)
Affinity DataKi:  5.01E+3nM. Assay description: Binding affinity to human NK3 receptor expressed in CHO cells
In DepthDetails ArticlePubMed