BDBM50074822 2-Phenyl-quinoline-4-carboxylic acid (1-phenyl-ethyl)-amide::CHEMBL274763
SMILES CC(NC(=O)c1cc(nc2ccccc12)-c1ccccc1)c1ccccc1
InChI Key InChIKey=IEDWYQQEMKCMSQ-UHFFFAOYSA-N
Data  2 KI  3 IC50
  Tab Delimited (TSV)   2D SDfile   Computed 3D by Vconf -m prep SDfile
Find this compound or compounds like it in BindingDB:
Activity Spreadsheet -- Enzyme Inhibition Constant Data from BindingDB
Found 5 hits for monomerid = 50074822
TargetNeuromedin-K receptor(Homo sapiens (Human))
Northeast Ohio Medical University
Curated by ChEMBL
LigandPNGBDBM50074822(2-Phenyl-quinoline-4-carboxylic acid (1-phenyl-eth...)
Affinity DataKi:  251nM. Assay description: Binding affinity to human NK3 receptor expressed in CHO cells
In DepthDetails ArticlePubMed
TargetNeuromedin-K receptor(Homo sapiens (Human))
Northeast Ohio Medical University
Curated by ChEMBL
LigandPNGBDBM50074822(2-Phenyl-quinoline-4-carboxylic acid (1-phenyl-eth...)
Affinity DataKi:  264nM. Assay description: Binding affinity towards cloned human Tachykinin receptor 3 (hNK-3) expressed in CHO cells using [125I][MePhe7]-NKB
In DepthDetails ArticlePubMed
TargetNeuromedin-K receptor(Homo sapiens (Human))
Northeast Ohio Medical University
Curated by ChEMBL
LigandPNGBDBM50074822(2-Phenyl-quinoline-4-carboxylic acid (1-phenyl-eth...)
Affinity DataIC50:  9.90E+3nM. Assay description: Antagonist activity against human NK3 receptor expressed in HEK293 cells assessed as inhibition of MePhe7-NKB-induced increase of intracellular calci...
In DepthDetails ArticlePubMed
TargetNeuromedin-K receptor(Homo sapiens (Human))
Northeast Ohio Medical University
Curated by ChEMBL
LigandPNGBDBM50074822(2-Phenyl-quinoline-4-carboxylic acid (1-phenyl-eth...)
Affinity DataIC50:  33.5nM. Assay description: Displacement of [125I]-MePhe7-NKB from human NK3 receptor expressed in CHO cells after 90 mins by gamma counting
In DepthDetails ArticlePubMed
TargetNeuromedin-K receptor(Homo sapiens (Human))
Northeast Ohio Medical University
Curated by ChEMBL
LigandPNGBDBM50074822(2-Phenyl-quinoline-4-carboxylic acid (1-phenyl-eth...)
Affinity DataIC50:  2.20E+3nM. Assay description: Antagonist activity against human NK3 receptor expressed in CHO cells assessed as inhibition of senktide-induced increase of intracellular calcium le...
In DepthDetails ArticlePubMed