BDBM50075079 CHEMBL334501::Sodium; 4-{2-[(4-chloro-benzenesulfonylamino)-methyl]-indan-5-yl}-butyrate
SMILES [O-]C(=O)CCCc1ccc2CC(CNS(=O)(=O)c3ccc(Cl)cc3)Cc2c1
InChI Key InChIKey=RMBCYAJNOOPWJQ-UHFFFAOYSA-M
Data  2 IC50
  Tab Delimited (TSV)   2D SDfile   Computed 3D by Vconf -m prep SDfile
Find this compound or compounds like it in BindingDB:
Activity Spreadsheet -- Enzyme Inhibition Constant Data from BindingDB
Found 2 hits for monomerid = 50075079
TargetThromboxane A2 receptor(RAT)
Zeria Pharmaceutical
Curated by ChEMBL
LigandPNGBDBM50075079(CHEMBL334501 | Sodium; 4-{2-[(4-chloro-benzenesulf...)
Affinity DataIC50:  39nM. Assay description: In vitro thromboxane A2 antagonistic activity of the compound on U-46619 (0.1 uM) induced contraction of rat aorta
In DepthDetails ArticlePubMed
TargetThromboxane A2 receptor(Homo sapiens (Human))
Zeria Pharmaceutical
Curated by ChEMBL
LigandPNGBDBM50075079(CHEMBL334501 | Sodium; 4-{2-[(4-chloro-benzenesulf...)
Affinity DataIC50:  1.34E+3nM. Assay description: In vitro thromboxane A2 antagonistic activity on aggregation of rabbit platelets induced by U-46,619 (4 uM)
In DepthDetails ArticlePubMed