BDBM50075087 CHEMBL134128::Sodium; {2-[(pyridine-3-sulfonylamino)-methyl]-indan-5-yl}-acetate
SMILES [O-]C(=O)Cc1ccc2CC(CNS(=O)(=O)c3cccnc3)Cc2c1
InChI Key InChIKey=RACHNJANFRRGQE-UHFFFAOYSA-M
Data  2 IC50
  Tab Delimited (TSV)   2D SDfile   Computed 3D by Vconf -m prep SDfile
Find this compound or compounds like it in BindingDB:
Activity Spreadsheet -- Enzyme Inhibition Constant Data from BindingDB
Found 2 hits for monomerid = 50075087
TargetThromboxane A2 receptor(RAT)
Zeria Pharmaceutical
Curated by ChEMBL
LigandPNGBDBM50075087(CHEMBL134128 | Sodium; {2-[(pyridine-3-sulfonylami...)
Affinity DataIC50:  1.90E+3nM. Assay description: In vitro thromboxane A2 antagonistic activity of the compound on U-46619 (0.1 uM) induced contraction of rat aorta
In DepthDetails ArticlePubMed
TargetThromboxane A2 receptor(Homo sapiens (Human))
Zeria Pharmaceutical
Curated by ChEMBL
LigandPNGBDBM50075087(CHEMBL134128 | Sodium; {2-[(pyridine-3-sulfonylami...)
Affinity DataIC50: >1.00E+5nM. Assay description: In vitro thromboxane A2 antagonistic activity on aggregation of rabbit platelets induced by U-46,619 (4 uM)
In DepthDetails ArticlePubMed