BDBM50076529 2-(4-Methanesulfonyl-phenyl)-3-phenyl-pyrazine::CHEMBL172720
SMILES CS(=O)(=O)c1ccc(cc1)-c1nccnc1-c1ccccc1
InChI Key InChIKey=VPFPZWIWCHWHJI-UHFFFAOYSA-N
Data  2 IC50
  Tab Delimited (TSV)   2D SDfile   Computed 3D by Vconf -m prep SDfile
Find this compound or compounds like it in BindingDB:
Activity Spreadsheet -- Enzyme Inhibition Constant Data from BindingDB
Found 2 hits for monomerid = 50076529
TargetProstaglandin G/H synthase 2(Homo sapiens (Human))
Dupont Pharmaceuticals
Curated by ChEMBL
LigandPNGBDBM50076529(2-(4-Methanesulfonyl-phenyl)-3-phenyl-pyrazine | C...)
Affinity DataIC50: >3.00E+5nM. Assay description: In vitro inhibitory concentration against recombinant human Prostaglandin G/H synthase 2 obtained from baculovirus
In DepthDetails ArticlePubMed
TargetProstaglandin G/H synthase 1(Ovis aries (Sheep))
Dupont Pharmaceuticals
Curated by ChEMBL
LigandPNGBDBM50076529(2-(4-Methanesulfonyl-phenyl)-3-phenyl-pyrazine | C...)
Affinity DataIC50: >3.00E+5nM. Assay description: In vitro inhibitory concentration against ovine COX-1
In DepthDetails ArticlePubMed