BDBM50076658 CHEMBL174501::methyl 3-[5-(4-chlorophenyl)-1-(4-methoxyphenyl)-1H-pyrazol-3-yl]-1-methylprop-2-ynyl(hydroxy)carbamate
SMILES COC(=O)N(O)C(C)C#Cc1cc(-c2ccc(Cl)cc2)n(n1)-c1ccc(OC)cc1
InChI Key InChIKey=CKQXIUFNWJAPTG-UHFFFAOYSA-N
Data  3 IC50
  Tab Delimited (TSV)   2D SDfile   Computed 3D by Vconf -m prep SDfile
Find this compound or compounds like it in BindingDB:
Activity Spreadsheet -- Enzyme Inhibition Constant Data from BindingDB
Found 3 hits for monomerid = 50076658
TargetProstaglandin G/H synthase 1(Ovis aries (Sheep))
The R. W. Johnson Pharmaceutical Research Institute
Curated by ChEMBL
LigandPNGBDBM50076658(CHEMBL174501 | methyl 3-[5-(4-chlorophenyl)-1-(4-m...)
Affinity DataIC50:  1.62E+3nM. Assay description: Inhibitory activity against Cyclooxygenase using sheep seminal vesicle (SSV) enzyme (COX-1)
In DepthDetails ArticlePubMed
TargetProstaglandin G/H synthase 1/2(RAT)
The R. W. Johnson Pharmaceutical Research Institute
Curated by ChEMBL
LigandPNGBDBM50076658(CHEMBL174501 | methyl 3-[5-(4-chlorophenyl)-1-(4-m...)
Affinity DataIC50:  290nM. Assay description: Inhibitory activity against cyclooxygenase (COX) in intact rat barophilic leukemia cells (RBL-1)
In DepthDetails ArticlePubMed
TargetPolyunsaturated fatty acid 5-lipoxygenase(Rattus norvegicus)
The R. W. Johnson Pharmaceutical Research Institute
Curated by ChEMBL
LigandPNGBDBM50076658(CHEMBL174501 | methyl 3-[5-(4-chlorophenyl)-1-(4-m...)
Affinity DataIC50:  8.70E+3nM. Assay description: Inhibitory activity against 5-lipoxygenase (5-LO) in intact rat barophilic leukemia cells (RBL-1)
In DepthDetails ArticlePubMed