BDBM50076813 CHEMBL10687::Lithium; (S)-2-({5-[5-(2-methoxy-phenyl)-furan-2-ylmethoxymethyl]-2'-methyl-biphenyl-2-carbonyl}-amino)-4-methylsulfanyl-butyrate
SMILES COc1ccccc1-c1ccc(COCc2ccc(C(=O)N[C@@H](CCSC)C([O-])=O)c(c2)-c2ccccc2C)o1
InChI Key InChIKey=ODRIJWKMQUKGQK-NDEPHWFRSA-M
Data  1 IC50  1 EC50
  Tab Delimited (TSV)   2D SDfile   Computed 3D by Vconf -m prep SDfile
Find this compound or compounds like it in BindingDB:
Activity Spreadsheet -- Enzyme Inhibition Constant Data from BindingDB
Found 2 hits for monomerid = 50076813
LigandPNGBDBM50076813(CHEMBL10687 | Lithium; (S)-2-({5-[5-(2-methoxy-phe...)
Affinity DataEC50: >1nM. Assay description: EC50 is measured as inhibition of ras processing in a whole cell assay for farnesyltransferase (FTase)
In DepthDetails ArticlePubMed
LigandPNGBDBM50076813(CHEMBL10687 | Lithium; (S)-2-({5-[5-(2-methoxy-phe...)
Affinity DataIC50:  20nM. Assay description: In vitro inhibitory activity of the compound was evaluated against farnesyltransferase (FTase)
In DepthDetails ArticlePubMed