BDBM50076866 2-(2-Chloro-phenyl)-5-(4-methanesulfonyl-phenyl)-4-phenyl-thiazole::CHEMBL443993
SMILES CS(=O)(=O)c1ccc(cc1)-c1sc(nc1-c1ccccc1)-c1ccccc1Cl
InChI Key InChIKey=GAZUHBWABSZZFH-UHFFFAOYSA-N
Data  2 IC50
  Tab Delimited (TSV)   2D SDfile   Computed 3D by Vconf -m prep SDfile
Find this compound or compounds like it in BindingDB:
Activity Spreadsheet -- Enzyme Inhibition Constant Data from BindingDB
Found 2 hits for monomerid = 50076866
TargetProstaglandin G/H synthase 2(Homo sapiens (Human))
G.D. Searle-Monsanto
Curated by ChEMBL
LigandPNGBDBM50076866(2-(2-Chloro-phenyl)-5-(4-methanesulfonyl-phenyl)-4...)
Affinity DataIC50:  10nM. Assay description: Inhibition of human cyclooxygenase-2 (hCOX-2) enzyme.
In DepthDetails ArticlePubMed
TargetProstaglandin G/H synthase 1(Homo sapiens (Human))
G.D. Searle-Monsanto
Curated by ChEMBL
LigandPNGBDBM50076866(2-(2-Chloro-phenyl)-5-(4-methanesulfonyl-phenyl)-4...)
Affinity DataIC50: >1.00E+5nM. Assay description: Inhibition of human cyclooxygenase-1 (hCOX-1) enzyme.
In DepthDetails ArticlePubMed