BDBM50076873 2-(2-Chloro-phenyl)-4-(4-fluoro-phenyl)-5-(4-methanesulfonyl-phenyl)-thiazole::CHEMBL277115
SMILES CS(=O)(=O)c1ccc(cc1)-c1sc(nc1-c1ccc(F)cc1)-c1ccccc1Cl
InChI Key InChIKey=VCLNQQUCGTWUKD-UHFFFAOYSA-N
Data  3 IC50
  Tab Delimited (TSV)   2D SDfile   Computed 3D by Vconf -m prep SDfile
Find this compound or compounds like it in BindingDB:
Activity Spreadsheet -- Enzyme Inhibition Constant Data from BindingDB
Found 3 hits for monomerid = 50076873
TargetProstaglandin G/H synthase 1(Homo sapiens (Human))
G.D. Searle-Monsanto
Curated by ChEMBL
LigandPNGBDBM50076873(2-(2-Chloro-phenyl)-4-(4-fluoro-phenyl)-5-(4-metha...)
Affinity DataIC50: >1.00E+5nM. Assay description: Inhibition of human cyclooxygenase-1 (hCOX-1) enzyme.
In DepthDetails ArticlePubMed
TargetProstaglandin G/H synthase 2(Homo sapiens (Human))
The M.S University Of Baroda
Curated by ChEMBL
LigandPNGBDBM50076873(2-(2-Chloro-phenyl)-4-(4-fluoro-phenyl)-5-(4-metha...)
Affinity DataIC50:  50nM. Assay description: Inhibition of human COX-2
In DepthDetails ArticlePubMed
TargetProstaglandin G/H synthase 2(Homo sapiens (Human))
The M.S University Of Baroda
Curated by ChEMBL
LigandPNGBDBM50076873(2-(2-Chloro-phenyl)-4-(4-fluoro-phenyl)-5-(4-metha...)
Affinity DataIC50:  50nM. Assay description: Inhibition of human cyclooxygenase-2 (hCOX-2) enzyme.
In DepthDetails ArticlePubMed