BDBM50078835 5-Phenyl-2H-tetrazole::5-phenyl-1H-tetrazole::CHEMBL39261
SMILES c1ccc(cc1)-c1nnn[nH]1
InChI Key InChIKey=MARUHZGHZWCEQU-UHFFFAOYSA-N
Data  1 Kd
  Tab Delimited (TSV)   2D SDfile   Computed 3D by Vconf -m prep SDfile
Find this compound or compounds like it in BindingDB:
Activity Spreadsheet -- Enzyme Inhibition Constant Data from BindingDB
Found 1 hit for monomerid = 50078835
TargetSerine/threonine-protein kinase mTOR(Homo sapiens (Human))
Abbott Laboratories
Curated by ChEMBL
LigandPNGBDBM50078835(5-Phenyl-2H-tetrazole | 5-phenyl-1H-tetrazole | CH...)
Affinity DataKd: >1.00E+7nM. Assay description: Dissociation constant when binding to FK506 binding protein (FKBP).
In DepthDetails ArticlePubMed