BDBM50081693 Azepane-1-carboxylic acid ((S)-1-{4-[(4-benzyloxy-phenyl)-(3-hydroxy-butyl)-amino]-piperidine-1-carbonyl}-3-methyl-butyl)-amide::CHEMBL337744
SMILES CC(C)C[C@H](NC(=O)N1CCCCCC1)C(=O)N1CCC(CC1)N(CCC(C)O)c1ccc(OCc2ccccc2)cc1
InChI Key InChIKey=MTUGVNCYQNDKSG-OVUYURIWSA-N
Data  1 IC50
  Tab Delimited (TSV)   2D SDfile   Computed 3D by Vconf -m prep SDfile
Find this compound or compounds like it in BindingDB:
Activity Spreadsheet -- Enzyme Inhibition Constant Data from BindingDB
Found 1 hit for monomerid = 50081693
TargetVoltage-dependent N-type calcium channel subunit alpha-1B(Homo sapiens (Human))
Warner-Lambert
Curated by ChEMBL
LigandPNGBDBM50081693(Azepane-1-carboxylic acid ((S)-1-{4-[(4-benzyloxy-...)
Affinity DataIC50:  4.60E+3nM. Assay description: Inhibition of N-type calcium channels in IMR32 human neuroblastoma cells
In DepthDetails ArticlePubMed