BDBM50082347 3-Benzoyl-4-(4-methanesulfonyl-phenyl)-5,5-dimethyl-5H-furan-2-one::CHEMBL325370
SMILES CC1(C)OC(=O)C(C(=O)c2ccccc2)=C1c1ccc(cc1)S(C)(=O)=O
InChI Key InChIKey=SBPBUYQZVFIIBK-UHFFFAOYSA-N
Data  4 IC50
  Tab Delimited (TSV)   2D SDfile   Computed 3D by Vconf -m prep SDfile
Find this compound or compounds like it in BindingDB:
Activity Spreadsheet -- Enzyme Inhibition Constant Data from BindingDB
Found 4 hits for monomerid = 50082347
TargetProstaglandin G/H synthase 1(Homo sapiens (Human))
Merck Frosst Centre For Therapeutic Research
Curated by ChEMBL
LigandPNGBDBM50082347(3-Benzoyl-4-(4-methanesulfonyl-phenyl)-5,5-dimethy...)
Affinity DataIC50: >5.00E+4nM. Assay description: In vitro inhibitory potency against human COX-2 in stably transfected chinese hamster ovary (CHO) cells
In DepthDetails ArticlePubMed
TargetProstaglandin G/H synthase 2(Homo sapiens (Human))
Merck Frosst Centre For Therapeutic Research
Curated by ChEMBL
LigandPNGBDBM50082347(3-Benzoyl-4-(4-methanesulfonyl-phenyl)-5,5-dimethy...)
Affinity DataIC50:  800nM. Assay description: In vitro inhibitory potency against human COX-2 (HWB COX-2) by whole blood assay
In DepthDetails ArticlePubMed
TargetProstaglandin G/H synthase 1(Homo sapiens (Human))
Merck Frosst Centre For Therapeutic Research
Curated by ChEMBL
LigandPNGBDBM50082347(3-Benzoyl-4-(4-methanesulfonyl-phenyl)-5,5-dimethy...)
Affinity DataIC50: >9.00E+4nM. Assay description: In vitro inhibitory potency against human COX-1 (HWB COX-2) by whole blood assay
In DepthDetails ArticlePubMed
TargetProstaglandin G/H synthase 2(Homo sapiens (Human))
Merck Frosst Centre For Therapeutic Research
Curated by ChEMBL
LigandPNGBDBM50082347(3-Benzoyl-4-(4-methanesulfonyl-phenyl)-5,5-dimethy...)
Affinity DataIC50:  600nM. Assay description: In vitro inhibitory potency against human COX-2 in stably transfected chinese hamster ovary (CHO) cells
In DepthDetails ArticlePubMed