BDBM50085665 (2S,3S,4R,5R)-5-[2-Cyclopentylamino-6-(2,2-diphenyl-ethylamino)-purin-9-yl]-3,4-dihydroxy-tetrahydro-furan-2-carboxylic acid ethylamide::CHEMBL435188
SMILES CCNC(=O)[C@H]1O[C@H]([C@H](O)[C@@H]1O)n1cnc2c(NCC(c3ccccc3)c3ccccc3)nc(NC3CCCC3)nc12
InChI Key InChIKey=PXCULGMOGVUPCB-YRIIQKNPSA-N
Data  2 KI
  Tab Delimited (TSV)   2D SDfile   Computed 3D by Vconf -m prep SDfile
Find this compound or compounds like it in BindingDB:
Activity Spreadsheet -- Enzyme Inhibition Constant Data from BindingDB
Found 2 hits for monomerid = 50085665
TargetAdenosine receptor A2a(Homo sapiens (Human))
Glaxowellcome Medicines Research Centre
Curated by ChEMBL
LigandPNGBDBM50085665((2S,3S,4R,5R)-5-[2-Cyclopentylamino-6-(2,2-dipheny...)
Affinity DataKi:  6.20nM. Assay description: In vitro inhibition of human neutrophil activation via Adenosine A2A receptor.
In DepthDetails ArticlePubMed
TargetAdenosine receptor A1(GUINEA PIG)
Glaxowellcome Medicines Research Centre
Curated by ChEMBL
LigandPNGBDBM50085665((2S,3S,4R,5R)-5-[2-Cyclopentylamino-6-(2,2-dipheny...)
Affinity DataKi: >5.00E+3nM. Assay description: Ex vivo inhibition of guinea pig ileum twitch via Adenosine A1 receptor.
In DepthDetails ArticlePubMed