BDBM50085992 CHEMBL268905::N-[(2S,4R)-1-(2-Benzoyl-benzoyl)-4-(biphenyl-2-ylmethoxy)-pyrrolidin-2-ylmethyl]-4-[2,4-dioxo-thiazolidin-(5Z)-ylidenemethyl]-benzamide::N-[1-(2-Benzoyl-benzoyl)-4-(biphenyl-2-ylmethoxy)-pyrrolidin-2-ylmethyl]-4-(2,4-dioxo-thiazolidin-5-ylidenemethyl)-benzamide
SMILES OC1=NC(=O)C(S1)=Cc1ccc(cc1)C(=O)NC[C@@H]1C[C@H](CN1C(=O)c1ccccc1C(=O)c1ccccc1)OCc1ccccc1-c1ccccc1
InChI Key InChIKey=SWCLXBYKQXAJGN-SZAHLOSFSA-N
Data  2 IC50
  Tab Delimited (TSV)   2D SDfile   Computed 3D by Vconf -m prep SDfile
Find this compound or compounds like it in BindingDB:
Activity Spreadsheet -- Enzyme Inhibition Constant Data from BindingDB
Found 2 hits for monomerid = 50085992
TargetCytosolic phospholipase A2 gamma(Homo sapiens (Human))
Shionogi
Curated by ChEMBL
LigandPNGBDBM50085992(CHEMBL268905 | N-[(2S,4R)-1-(2-Benzoyl-benzoyl)-4-...)
Affinity DataIC50:  165nM. Assay description: Concentration required to inhibit human Cytosolic phospholipase A2
In DepthDetails ArticlePubMed
TargetCytosolic phospholipase A2(Homo sapiens (Human))
Shionogi
Curated by ChEMBL
LigandPNGBDBM50085992(CHEMBL268905 | N-[(2S,4R)-1-(2-Benzoyl-benzoyl)-4-...)
Affinity DataIC50:  165nM. Assay description: Inhibition of Human cPLA2 alpha using Enzyme assay(PC/DOG assay)
In DepthDetails ArticlePubMed