BDBM50085996 CHEMBL266580::N-[1-(4-Benzoyl-benzoyl)-4-(biphenyl-2-ylmethoxy)-pyrrolidin-2-ylmethyl]-4-(2,4-dioxo-thiazolidin-5-ylidenemethyl)-benzamide
SMILES OC1=NC(=O)C(S1)=Cc1ccc(cc1)C(=O)NC[C@@H]1C[C@H](CN1C(=O)c1ccc(cc1)C(=O)c1ccccc1)OCc1ccccc1-c1ccccc1
InChI Key InChIKey=BJGGWVLAFQHYOK-MPQUPPDSSA-N
Data  1 IC50
  Tab Delimited (TSV)   2D SDfile   Computed 3D by Vconf -m prep SDfile
Find this compound or compounds like it in BindingDB:
Activity Spreadsheet -- Enzyme Inhibition Constant Data from BindingDB
Found 1 hit for monomerid = 50085996
TargetCytosolic phospholipase A2(Homo sapiens (Human))
Shionogi
Curated by ChEMBL
LigandPNGBDBM50085996(CHEMBL266580 | N-[1-(4-Benzoyl-benzoyl)-4-(bipheny...)
Affinity DataIC50: >1.00E+4nM. Assay description: Inhibition of Human cPLA2 alpha using Enzyme assay(PC/DOG assay)
In DepthDetails ArticlePubMed