BDBM50087091 C-{[2-(1-Carboxy-2-phenyl-ethylcarbamoyl)-3-phenyl-propyl]-hydroxy-phosphinoyl}-C-(2,4-dimethyl-phenyl)-methyl-ammonium
SMILES Cc1ccc(C([NH3+])P(O)(=O)C[C@@H](Cc2ccccc2)C(=O)N[C@@H](Cc2ccccc2)C(O)=O)c(C)c1
InChI Key InChIKey=LQCMSKDPCGDUHN-MXYRDWRVSA-O
Data  2 KI
  Tab Delimited (TSV)   2D SDfile   Computed 3D by Vconf -m prep SDfile
Find this compound or compounds like it in BindingDB:
Activity Spreadsheet -- Enzyme Inhibition Constant Data from BindingDB
Found 2 hits for monomerid = 50087091
TargetAminopeptidase N(Sus scrofa (Pig))
University Of Paris
Curated by ChEMBL
LigandPNGBDBM50087091(C-{[2-(1-Carboxy-2-phenyl-ethylcarbamoyl)-3-phenyl...)
Affinity DataKi:  130nM. Assay description: Inhibitory activity on aminopeptidase N (APN) using Ala-pNA as substrate.
In DepthDetails ArticlePubMed
TargetNeprilysin(Oryctolagus cuniculus (rabbit))
University Of Paris
Curated by ChEMBL
LigandPNGBDBM50087091(C-{[2-(1-Carboxy-2-phenyl-ethylcarbamoyl)-3-phenyl...)
Affinity DataKi:  230nM. Assay description: Inhibitory activity on neutral endopeptidase (NEP) using DGNPA as substrate.
In DepthDetails ArticlePubMed