BDBM50087382 CHEMBL288414::Sodium; 2-[2-(8-hydroxy-7,8-dihydro-6H-imidazo[4,5-d][1,3]diazepin-3-yl)-ethoxy]-benzoate (3.5H2O)
SMILES OC1CNC=Nc2c1ncn2CCOc1ccccc1C([O-])=O
InChI Key InChIKey=ROJINXWZZMSWRW-UHFFFAOYSA-M
Data  1 KI
  Tab Delimited (TSV)   2D SDfile   Computed 3D by Vconf -m prep SDfile
Find this compound or compounds like it in BindingDB:
Activity Spreadsheet -- Enzyme Inhibition Constant Data from BindingDB
Found 1 hit for monomerid = 50087382
TargetAdenosine deaminase(Bos taurus (bovine))
Metabasis Therapeutics
Curated by ChEMBL
LigandPNGBDBM50087382(CHEMBL288414 | Sodium; 2-[2-(8-hydroxy-7,8-dihydro...)
Affinity DataKi:  2.70E+5nM. Assay description: Inhibitory activity against calf intestinal Adenosine deaminase (ADA)
In DepthDetails ArticlePubMed