BDBM50090027 (R)-4-(3,4-Difluoro-phenyl)-1,3,6-trimethyl-2-oxo-1,2,3,4-tetrahydro-pyrimidine-5-carboxylic acid {3-[4-(4-fluoro-phenyl)-piperidin-1-yl]-propyl}-amide::CHEMBL90420
SMILES CN1[C@@H](C(C(=O)NCCCN2CCC(CC2)c2ccc(F)cc2)=C(C)N(C)C1=O)c1ccc(F)c(F)c1
InChI Key InChIKey=JNWYRENLYPYLET-AREMUKBSSA-N
Data  4 KI
  Tab Delimited (TSV)   2D SDfile   Computed 3D by Vconf -m prep SDfile
Find this compound or compounds like it in BindingDB:
Activity Spreadsheet -- Enzyme Inhibition Constant Data from BindingDB
Found 4 hits for monomerid = 50090027
TargetAlpha-1A adrenergic receptor(Homo sapiens (Human))
Indo-Soviet Friendship College of Pharmacy (Isfcp)
Curated by ChEMBL
LigandPNGBDBM50090027((R)-4-(3,4-Difluoro-phenyl)-1,3,6-trimethyl-2-oxo-...)
Affinity DataKi:  0.140nM. Assay description: Displacement of [125I]L-762,459 from recombinant human alpha1a adrenergic receptor expressed in mammalian cells measured after 1 hr
In DepthDetails ArticlePubMed
TargetAlpha-1A adrenergic receptor(Homo sapiens (Human))
Indo-Soviet Friendship College of Pharmacy (Isfcp)
Curated by ChEMBL
LigandPNGBDBM50090027((R)-4-(3,4-Difluoro-phenyl)-1,3,6-trimethyl-2-oxo-...)
Affinity DataKi:  0.180nM. Assay description: Ability to displace [125I]- HEAT from human cloned Alpha-1A adrenergic receptor stably expressed in CHO cells.
In DepthDetails ArticlePubMed
TargetAlpha-1B adrenergic receptor(Homo sapiens (Human))
Merck Research Laboratories
Curated by ChEMBL
LigandPNGBDBM50090027((R)-4-(3,4-Difluoro-phenyl)-1,3,6-trimethyl-2-oxo-...)
Affinity DataKi:  20nM. Assay description: Ability to displace [125I]- HEAT from human cloned Alpha-1B adrenergic receptor stably expressed in LM cells.
In DepthDetails ArticlePubMed
TargetAlpha-1D adrenergic receptor(Homo sapiens (Human))
Merck Research Laboratories
Curated by ChEMBL
LigandPNGBDBM50090027((R)-4-(3,4-Difluoro-phenyl)-1,3,6-trimethyl-2-oxo-...)
Affinity DataKi:  200nM. Assay description: Ability to displace [125I]- HEAT from human cloned Alpha-1D adrenergic receptor stably expressed in HEK cells.
In DepthDetails ArticlePubMed