BDBM50091565 3-[2-(2-Benzyloxycarbonylamino-3-methyl-butyrylamino)-propionylamino]-4-[5-(2-chloro-phenyl)-oxazol-2-yl]-4-oxo-butyric acid::CHEMBL113012
SMILES CC(C)[C@H](NC(=O)OCc1ccccc1)C(=O)N[C@@H](C)C(=O)N[C@@H](CC(O)=O)C(=O)c1ncc(o1)-c1ccccc1Cl
InChI Key InChIKey=QXTMJQUGIRZSCW-JBUDQFAYSA-N
Data  1 KI
  Tab Delimited (TSV)   2D SDfile   Computed 3D by Vconf -m prep SDfile
Find this compound or compounds like it in BindingDB:
Activity Spreadsheet -- Enzyme Inhibition Constant Data from BindingDB
Found 1 hit for monomerid = 50091565
TargetCaspase-1(Homo sapiens (Human))
Basf Bioresearch
Curated by ChEMBL
LigandPNGBDBM50091565(3-[2-(2-Benzyloxycarbonylamino-3-methyl-butyrylami...)
Affinity DataKi:  260nM. Assay description: Compound was evaluated for the inhibitory activity against caspase-1
In DepthDetails ArticlePubMed