BDBM50092056 (2E,4E,6E,8E)-3,7-dimethyl-9-(2,6,6-trimethylcyclohex-1-en-1-yl)nona-2,4,6,8-tetraen-1-ol::Afaxin::Alphalin::CHEMBL986::Chocola A::Retinol::all-trans-retinol::all-trans-retinyl alcohol::all-trans-vitamin A alcohol
SMILES C\C(=C/CO)\C=C\C=C(/C)\C=C\C1=C(C)CCCC1(C)C
InChI Key InChIKey=FPIPGXGPPPQFEQ-OVSJKPMPSA-N
Data  2 IC50  1 Kd
PDB links: 33 PDB IDs match this monomer.
  Tab Delimited (TSV)   2D SDfile   Computed 3D by Vconf -m prep SDfile
Find this compound or compounds like it in BindingDB:
Activity Spreadsheet -- Enzyme Inhibition Constant Data from BindingDB
Found 3 hits for monomerid = 50092056
TargetBeta-lactoglobulin(Bos taurus)
University Of Helsinki
Curated by ChEMBL
LigandPNGBDBM50092056((2E,4E,6E,8E)-3,7-dimethyl-9-(2,6,6-trimethylcyclo...)
Affinity DataKd:  36nM. Assay description: Binding affinity to bovine beta-lactoglobulins by fluorescence spectroscopy
TargetAmyloid-beta precursor protein(Homo sapiens (Human))
Universit£
Curated by ChEMBL
LigandPNGBDBM50092056((2E,4E,6E,8E)-3,7-dimethyl-9-(2,6,6-trimethylcyclo...)
Affinity DataIC50:  180nM. Assay description: Inhibition of amyloid beta (1 to 40) (unknown origin) incubated for 24 hrs to 7 days by thioflavin S based fluorescence assay
In DepthDetails ArticlePubMed
TargetAlpha-synuclein(Homo sapiens (Human))
Universit£
Curated by ChEMBL
LigandPNGBDBM50092056((2E,4E,6E,8E)-3,7-dimethyl-9-(2,6,6-trimethylcyclo...)
Affinity DataIC50:  190nM. Assay description: Inhibition of alpha-synuclein fibril formation (unknown origin) incubated for 24 hrs to 7 days by thioflavin S based fluorescence assay
In DepthDetails ArticlePubMed