BDBM50095467 CHEMBL3590472
SMILES Cn1cc(NC(=O)c2cnn3ccc(N[C@H]4CCCC[C@@H]4N)nc23)c(n1)C(N)=O
InChI Key InChIKey=SSMUXZNGWKTWKM-RYUDHWBXSA-N
Data  1 IC50
  Tab Delimited (TSV)   2D SDfile   Computed 3D by Vconf -m prep SDfile
Find this compound or compounds like it in BindingDB:
Activity Spreadsheet -- Enzyme Inhibition Constant Data from BindingDB
Found 1 hit for monomerid = 50095467
TargetInterleukin-1 receptor-associated kinase 4(Homo sapiens (Human))
Merck
Curated by ChEMBL
LigandPNGBDBM50095467(CHEMBL3590472)
Affinity DataIC50:  20nM. Assay description: Inhibition of human IRAK4 assessed as phosphorylation of fluorescent peptide substrate after 30 mins by fluorescent polarization reader
In DepthDetails ArticlePubMed