BDBM50095501 CHEMBL3590487
SMILES Cn1cc(NC(=O)c2cnn3ccc(nc23)N2CCNCC2)c(n1)C(F)(F)F
InChI Key InChIKey=ADZTYXDJSIPBIT-UHFFFAOYSA-N
Data  1 IC50
  Tab Delimited (TSV)   2D SDfile   Computed 3D by Vconf -m prep SDfile
Find this compound or compounds like it in BindingDB:
Activity Spreadsheet -- Enzyme Inhibition Constant Data from BindingDB
Found 1 hit for monomerid = 50095501
TargetInterleukin-1 receptor-associated kinase 4(Homo sapiens (Human))
Merck
Curated by ChEMBL
LigandPNGBDBM50095501(CHEMBL3590487)
Affinity DataIC50:  10nM. Assay description: Inhibition of human IRAK4 assessed as phosphorylation of fluorescent peptide substrate after 30 mins by fluorescent polarization reader
In DepthDetails ArticlePubMed