BDBM50096189 8-(3-Butyl-phenyl)-3-[(4-chloro-phenyl)-phenyl-methoxy]-8-aza-bicyclo[3.2.1]octane; hydrochloride::CHEMBL544880
SMILES CCCCc1cccc(c1)N1C2CCC1CC(C2)OC(c1ccccc1)c1ccc(Cl)cc1
InChI Key InChIKey=GCRWOSGGZZJFKD-UHFFFAOYSA-N
Data  4 KI
  Tab Delimited (TSV)   2D SDfile   Computed 3D by Vconf -m prep SDfile
Find this compound or compounds like it in BindingDB:
Activity Spreadsheet -- Enzyme Inhibition Constant Data from BindingDB
Found 4 hits for monomerid = 50096189
TargetSodium-dependent dopamine transporter(Rattus norvegicus (rat))
National Institute On Drug Abuse-Intramural Research Program
Curated by ChEMBL
LigandPNGBDBM50096189(8-(3-Butyl-phenyl)-3-[(4-chloro-phenyl)-phenyl-met...)
Affinity DataKi:  53.3nM. Assay description: Binding affinity for dopamine transporter was determined in vitro in rat brain using [3H]WIN-35428 s radioligand
In DepthDetails ArticlePubMed
TargetSodium-dependent serotonin transporter(Rattus norvegicus (rat))
National Institute On Drug Abuse-Intramural Research Program
Curated by ChEMBL
LigandPNGBDBM50096189(8-(3-Butyl-phenyl)-3-[(4-chloro-phenyl)-phenyl-met...)
Affinity DataKi:  737nM. Assay description: Binding affinity for serotonin transporter was determined in vitro in rat brain using [3H]citalopram as radioligand.
In DepthDetails ArticlePubMed
TargetMuscarinic acetylcholine receptor M1(RAT)
National Institute On Drug Abuse-Intramural Research Program
Curated by ChEMBL
LigandPNGBDBM50096189(8-(3-Butyl-phenyl)-3-[(4-chloro-phenyl)-phenyl-met...)
Affinity DataKi:  1.43E+3nM. Assay description: Binding affinity for muscarinic m1 receptor was determined in vitro in rat brain using [3H]pirenzepine as radioligand.
In DepthDetails ArticlePubMed
TargetTransporter(Rattus norvegicus)
National Institute On Drug Abuse-Intramural Research Program
Curated by ChEMBL
LigandPNGBDBM50096189(8-(3-Butyl-phenyl)-3-[(4-chloro-phenyl)-phenyl-met...)
Affinity DataKi:  2.32E+3nM. Assay description: Binding affinity for norepinephrine transporter in rat brain using [3H]-nisoxatine as radioligand
In DepthDetails ArticlePubMed