BDBM50099308 CHEMBL409360::[(3S,4R)-4-(4-Chloro-phenyl)-1-phenyl-pyrrolidin-3-yl]-phenyl-methanone::cid_5193459
SMILES Clc1ccc(cc1)[C@@H]1CN(C[C@H]1C(=O)c1ccccc1)c1ccccc1
InChI Key InChIKey=IKZMLJRPGOEGAR-FCHUYYIVSA-N
Data  1 KI  2 IC50
  Tab Delimited (TSV)   2D SDfile   Computed 3D by Vconf -m prep SDfile
Find this compound or compounds like it in BindingDB:
Activity Spreadsheet -- Enzyme Inhibition Constant Data from BindingDB
Found 3 hits for monomerid = 50099308
TargetSodium-dependent dopamine transporter(Rattus norvegicus (rat))
Georgetown University Medical Center
Curated by ChEMBL
LigandPNGBDBM50099308(CHEMBL409360 | [(3S,4R)-4-(4-Chloro-phenyl)-1-phen...)
Affinity DataKi: >1.00E+4nM. Assay description: Inhibition of [3H]DA uptake at Dopamine transporter in rat cortex.
In DepthDetails ArticlePubMed
TargetCoagulation factor XII(Homo sapiens (Human))
Pcmd
Curated by PubChem BioAssay
LigandPNGBDBM50099308(CHEMBL409360 | [(3S,4R)-4-(4-Chloro-phenyl)-1-phen...)
Affinity DataIC50: >5.00E+4nM. Assay description: Molecular Library Screening Center Network (MLSCN) Penn Center for Molecular Discovery (PCMD) Assay Provider: Scott L. Diamond, University of Pennsy...
In DepthDetails PCBioAssay
TargetKallikrein-5(Homo sapiens (Human))
Pcmd
Curated by PubChem BioAssay
LigandPNGBDBM50099308(CHEMBL409360 | [(3S,4R)-4-(4-Chloro-phenyl)-1-phen...)
Affinity DataIC50:  5.00E+4nM. Assay description: Molecular Library Screening Center Network (MLSCN) Penn Center for Molecular Discovery (PCMD) Assay Provider: Scott L. Diamond, University of Pennsy...
In DepthDetails PCBioAssay