BDBM50104045 CHEMBL106252::N-[3-Benzoyl-4-(2-p-tolyl-acetylamino)-phenyl]-nicotinamide
SMILES Cc1ccc(CC(=O)Nc2ccc(NC(=O)c3cccnc3)cc2C(=O)c2ccccc2)cc1
InChI Key InChIKey=IMRVIGSUVBVRQO-UHFFFAOYSA-N
Data  1 IC50
  Tab Delimited (TSV)   2D SDfile   Computed 3D by Vconf -m prep SDfile
Find this compound or compounds like it in BindingDB:
Activity Spreadsheet -- Enzyme Inhibition Constant Data from BindingDB
Found 1 hit for monomerid = 50104045
TargetProtein farnesyltransferase subunit beta/geranylgeranyltransferase type-1 subunit alpha(Saccharomyces cerevisiae (Baker's yeast))
Philipps-UniversitäT Marburg
Curated by ChEMBL
LigandPNGBDBM50104045(CHEMBL106252 | N-[3-Benzoyl-4-(2-p-tolyl-acetylami...)
Affinity DataIC50:  2.20E+4nM. Assay description: Inhibitory activity against yeast farnesyltransferase
In DepthDetails ArticlePubMed