BDBM50104468 CHEMBL313345::Phosphoric acid 2-chloro-phenyl ester 12-{(R)-3-(1H-indol-3-yl)-2-[((R)-pyrrolidine-2-carbonyl)-amino]-propionylamino}-dodecyl ester; compound with triethyl-amine
SMILES OP(=O)(OCCCCCCCCCCCCNC(=O)[C@@H](Cc1c[nH]c2ccccc12)NC(=O)[C@H]1CCCN1)Oc1ccccc1Cl
InChI Key InChIKey=XBNBUYXWHJKSJW-FIRIVFDPSA-N
Data  1 IC50
  Tab Delimited (TSV)   2D SDfile   Computed 3D by Vconf -m prep SDfile
Find this compound or compounds like it in BindingDB:
Activity Spreadsheet -- Enzyme Inhibition Constant Data from BindingDB
Found 1 hit for monomerid = 50104468
TargetTelomerase reverse transcriptase(Homo sapiens (Human))
Kyushu University
Curated by ChEMBL
LigandPNGBDBM50104468(CHEMBL313345 | Phosphoric acid 2-chloro-phenyl est...)
Affinity DataIC50: >1.00E+5nM. Assay description: Inhibitory activity against telomerase extracted from HCT 116 cell lines
In DepthDetails ArticlePubMed