BDBM50104645 CHEBI:32807::Orsellinic Acid
SMILES Cc1cc(O)cc(O)c1C(O)=O
InChI Key InChIKey=AMKYESDOVDKZKV-UHFFFAOYSA-N
Data  1 IC50
PDB links: 1 PDB ID matches this monomer.
  Tab Delimited (TSV)   2D SDfile   Computed 3D by Vconf -m prep SDfile
Find this compound or compounds like it in BindingDB:
Activity Spreadsheet -- Enzyme Inhibition Constant Data from BindingDB
Found 1 hit for monomerid = 50104645
TargetLysosomal alpha-glucosidase(Homo sapiens (Human))
Hebei University
Curated by ChEMBL
LigandPNGBDBM50104645(CHEBI:32807 | Orsellinic Acid)
Affinity DataIC50: >1.00E+5nM. Assay description: Inhibition of alpha-glucosidase (unknown origin) pre-incubated for 20 mins before p-nitrophenyl glycoside substrate addition
In DepthDetails ArticlePubMed