BDBM50105526 4-Phenyl-1-[(3S,4S)-4-phenyl-1-(3-phenyl-propyl)-pyrrolidin-3-ylmethyl]-piperidine::CHEMBL93277
SMILES C(CN1C[C@H](CN2CCC(CC2)c2ccccc2)[C@H](C1)c1ccccc1)Cc1ccccc1
InChI Key InChIKey=SAGVACGYDFCJIK-IOWSJCHKSA-N
Data  1 IC50
  Tab Delimited (TSV)   2D SDfile   Computed 3D by Vconf -m prep SDfile
Find this compound or compounds like it in BindingDB:
Activity Spreadsheet -- Enzyme Inhibition Constant Data from BindingDB
Found 1 hit for monomerid = 50105526
TargetC-C chemokine receptor type 5(Homo sapiens (Human))
Merck Research Laboratories
Curated by ChEMBL
LigandPNGBDBM50105526(4-Phenyl-1-[(3S,4S)-4-phenyl-1-(3-phenyl-propyl)-p...)
Affinity DataIC50: >1.00E+3nM. Assay description: Inhibitory concentration, binding towards C-C chemokine receptor type 5 using [125I]-MIP-1 alpha as radioligand expressed on CHO cells
In DepthDetails ArticlePubMed