BDBM50106444 1-(3-Hydroxy-4-methoxy-benzoyl)-6,7-dimethoxy-isoquinoline-3-carboxylic acid::CHEMBL132212
SMILES COc1ccc(cc1O)C(=O)c1nc(cc2cc(OC)c(OC)cc12)C(O)=O
InChI Key InChIKey=IQSBFNXCTOJXNY-UHFFFAOYSA-N
Data  1 KI
  Tab Delimited (TSV)   2D SDfile   Computed 3D by Vconf -m prep SDfile
Find this compound or compounds like it in BindingDB:
Activity Spreadsheet -- Enzyme Inhibition Constant Data from BindingDB
Found 1 hit for monomerid = 50106444
TargetInsulin-like growth factor-binding protein 3(Homo sapiens (Human))
Neurocrine Biosciences
Curated by ChEMBL
LigandPNGBDBM50106444(1-(3-Hydroxy-4-methoxy-benzoyl)-6,7-dimethoxy-isoq...)
Affinity DataKi: >1.00E+4nM. Assay description: Inhibitory activity against Insulin-like growth factor binding protein 3
In DepthDetails ArticlePubMed