BDBM50106450 3-(1-Benzoyl-1H-pyrrol-3-ylmethylene)-1-benzyl-piperidin-4-one::CHEMBL340854
SMILES O=C1CCN(Cc2ccccc2)CC1=Cc1c[nH]c2ccc(OCc3ccccc3)cc12
InChI Key InChIKey=XEJXROYAXRNSCE-UHFFFAOYSA-N
Data  1 IC50
  Tab Delimited (TSV)   2D SDfile   Computed 3D by Vconf -m prep SDfile
Find this compound or compounds like it in BindingDB:
Activity Spreadsheet -- Enzyme Inhibition Constant Data from BindingDB
Found 1 hit for monomerid = 50106450
TargetAcetylcholinesterase(Homo sapiens (Human))
Università
Curated by ChEMBL
LigandPNGBDBM50106450(3-(1-Benzoyl-1H-pyrrol-3-ylmethylene)-1-benzyl-pip...)
Affinity DataIC50:  2.50E+4nM. Assay description: Inhibitory concentration required against acetylcholinesterase activity
In DepthDetails ArticlePubMed