BDBM50106824 CHEMBL103784::N-(2-Hydroxy-5-{1-hydroxy-2-[1-(3-methoxy-phenyl)-2-phenyl-ethylamino]-ethyl}-phenyl)-methanesulfonamide
SMILES COc1cccc(c1)C(Cc1ccccc1)NCC(O)c1ccc(O)c(NS(C)(=O)=O)c1
InChI Key InChIKey=HISLBQUHLBEWBG-UHFFFAOYSA-N
Data  1 KI
  Tab Delimited (TSV)   2D SDfile   Computed 3D by Vconf -m prep SDfile
Find this compound or compounds like it in BindingDB:
Activity Spreadsheet -- Enzyme Inhibition Constant Data from BindingDB
Found 1 hit for monomerid = 50106824
TargetBeta-3 adrenergic receptor(Homo sapiens (Human))
Bristol-Myers Squibb Pharmaceutical Research Institute
Curated by ChEMBL
LigandPNGBDBM50106824(CHEMBL103784 | N-(2-Hydroxy-5-{1-hydroxy-2-[1-(3-m...)
Affinity DataKi:  230nM. Assay description: Binding affinity against CHO cells transfected with human beta-3 adrenergic receptor in the presence of [125I]iodocyanopindolol
In DepthDetails ArticlePubMed